Reaction Details
TargetTransient receptor potential cation channel subfamily V member 4
LigandBDBM50232797
Substrate/Competitorn/a
Meas. Tech.ChEMBL_1648651 (CHEMBL3997707)
IC50 2.0±n/a nM
Citation Cheung, MBao, WBehm, DJBrooks, CABury, MJDowdell, SEEidam, HSFox, RMGoodman, KBHolt, DALee, DRoethke, TJWillette, RNXu, XYe, GThorneloe, KS Discovery of GSK2193874: An Orally Active, Potent, and Selective Blocker of Transient Receptor Potential Vanilloid 4. ACS Med Chem Lett8:549-554 (2017) 
 
Transient receptor potential cation channel subfamily V member 4
Name:Transient receptor potential cation channel subfamily V member 4
Type:PROTEIN
Mol. Mass.:98016.72
Organism:Rattus norvegicus
Description:ChEMBL_1514408
Residue:871
BDBM50232797
NameBDBM50232797
Synonyms:CHEMBL4073922
TypeSmall organic molecule
Emp. Form.C37H38BrF3N4O
Mol. Mass.691.623
SMILESFC(F)(F)c1cccc(c1)-c1nc2cc(Br)ccc2c(C(=O)NC2(CC2)c2ccccc2)c1CN1CCC(CC1)N1CCCCC1