Reaction Details
TargetTransient receptor potential cation channel subfamily V member 4
LigandBDBM50232803
Substrate/Competitorn/a
Meas. Tech.ChEMBL_1648651 (CHEMBL3997707)
IC50 3.2±n/a nM
Citation Cheung, MBao, WBehm, DJBrooks, CABury, MJDowdell, SEEidam, HSFox, RMGoodman, KBHolt, DALee, DRoethke, TJWillette, RNXu, XYe, GThorneloe, KS Discovery of GSK2193874: An Orally Active, Potent, and Selective Blocker of Transient Receptor Potential Vanilloid 4. ACS Med Chem Lett8:549-554 (2017) 
 
Transient receptor potential cation channel subfamily V member 4
Name:Transient receptor potential cation channel subfamily V member 4
Type:PROTEIN
Mol. Mass.:98016.72
Organism:Rattus norvegicus
Description:ChEMBL_1514408
Residue:871
BDBM50232803
NameBDBM50232803
Synonyms:CHEMBL4068023
TypeSmall organic molecule
Emp. Form.C38H40F6N4O2
Mol. Mass.698.7402
SMILESCCOc1ccc2c(C(=O)N[C@H](c3ccccc3)C(F)(F)F)c(CN3CCC(CC3)N3CCCCC3)c(nc2c1)-c1cccc(c1)C(F)(F)F