Reaction Details
Target[Pyruvate dehydrogenase (acetyl-transferring)] kinase isozyme 2, mitochondrial
LigandBDBM50232925
Substrate/Competitorn/a
Meas. Tech.ChEMBL_1649543 (CHEMBL3998677)
IC50 565±n/a nM
Citation Tso, SCLou, MWu, CYGui, WJChuang, JLMorlock, LKWilliams, NSWynn, RMQi, XChuang, DT Development of Dihydroxyphenyl Sulfonylisoindoline Derivatives as Liver-Targeting Pyruvate Dehydrogenase Kinase Inhibitors. J Med Chem60:1142-1150 (2017) 
 
[Pyruvate dehydrogenase (acetyl-transferring)] kinase isozyme 2, mitochondrial
Name:[Pyruvate dehydrogenase (acetyl-transferring)] kinase isozyme 2, mitochondrial
Type:Enzyme
Mol. Mass.:46153.78
Organism:Homo sapiens (Human)
Description:Q15119
Residue:407
BDBM50232925
NameBDBM50232925
Synonyms:CHEMBL4095603
TypeSmall organic molecule
Emp. Form.C27H27N3O7S
Mol. Mass.537.584
SMILESOC(=O)c1ccccc1C(=O)N1CCC(CC1)Nc1ccc2CN(Cc2c1)S(=O)(=O)c1ccc(O)cc1O