Reaction Details
TargetLiver carboxylesterase 1
LigandBDBM50233193
Substrate/Competitorn/a
Meas. Tech.ChEMBL_1649827 (CHEMBL3998961)
Ki 18±n/a nM
Citation Hatfield, MJChen, JFratt, EMChi, LBollinger, JCBinder, RJBowling, JHyatt, JLScarborough, JJeffries, CPotter, PM Selective Inhibitors of Human Liver Carboxylesterase Based on aß-Lapachone Scaffold: Novel Reagents for Reaction Profiling. J Med Chem60:1568-1579 (2017) 
 
Liver carboxylesterase 1
Name:Liver carboxylesterase 1
Type:Protein
Mol. Mass.:62520.83
Organism:Homo sapiens (Human)
Description:n/a
Residue:567
BDBM50233193
NameBDBM50233193
Synonyms:CHEMBL4062476
TypeSmall organic molecule
Emp. Form.C18H15NO3
Mol. Mass.293.3166
SMILESCOc1ccc(cc1)N(C)C1=CC(=O)C(=O)c2ccccc12