Reaction Details
TargetEstrogen-related receptor gamma
LigandBDBM50233270
Substrate/Competitorn/a
Meas. Tech.ChEMBL_1650380 (CHEMBL3999514)
IC50 2500±n/a nM
Citation Yu, DDHuss, JMLi, HForman, BM Identification of novel inverse agonists of estrogen-related receptors ERR¿ and ERRß. Bioorg Med Chem25:1585-1599 (2017) 
 
Estrogen-related receptor gamma
Name:Estrogen-related receptor gamma
Type:PROTEIN
Mol. Mass.:51305.00
Organism:Homo sapiens (Human)
Description:ChEMBL_1501351
Residue:458
BDBM50233270
NameBDBM50233270
Synonyms:CHEMBL4091901
TypeSmall organic molecule
Emp. Form.C28H33NO3
Mol. Mass.431.5665
SMILESCC(CO)C\C(=C(/c1ccc(O)cc1)c1ccc(OCCN(C)C)cc1)c1ccccc1