Reaction Details
TargetEstrogen-related receptor gamma
LigandBDBM50233266
Substrate/Competitorn/a
Meas. Tech.ChEMBL_1650380 (CHEMBL3999514)
IC50 290±n/a nM
Citation Yu, DDHuss, JMLi, HForman, BM Identification of novel inverse agonists of estrogen-related receptors ERR¿ and ERRß. Bioorg Med Chem25:1585-1599 (2017) 
 
Estrogen-related receptor gamma
Name:Estrogen-related receptor gamma
Type:PROTEIN
Mol. Mass.:51305.00
Organism:Homo sapiens (Human)
Description:ChEMBL_1501351
Residue:458
BDBM50233266
NameBDBM50233266
Synonyms:CHEMBL4092854
TypeSmall organic molecule
Emp. Form.C27H31NO2
Mol. Mass.401.5405
SMILESCC(C)C(=C(/c1ccc(O)cc1)c1ccc(OCCN(C)C)cc1)\c1ccccc1