Reaction Details
TargetEstrogen-related receptor gamma
LigandBDBM50233272
Substrate/Competitorn/a
Meas. Tech.ChEMBL_1650380 (CHEMBL3999514)
IC50 300±n/a nM
Citation Yu, DDHuss, JMLi, HForman, BM Identification of novel inverse agonists of estrogen-related receptors ERR¿ and ERRß. Bioorg Med Chem25:1585-1599 (2017) 
 
Estrogen-related receptor gamma
Name:Estrogen-related receptor gamma
Type:PROTEIN
Mol. Mass.:51305.00
Organism:Homo sapiens (Human)
Description:ChEMBL_1501351
Residue:458
BDBM50233272
NameBDBM50233272
Synonyms:CHEMBL4064246
TypeSmall organic molecule
Emp. Form.C29H33NO4
Mol. Mass.459.5766
SMILESCN(C)CCOc1ccc(cc1)C(=C(\CCCO)c1ccccc1)\c1ccc(OC(C)=O)cc1