Reaction Details
TargetCathepsin K
LigandBDBM50213272
Substrate/Competitorn/a
Meas. Tech.ChEMBL_1650686 (CHEMBL3999820)
Ki 24±n/a nM
Citation Kruglyak, NWilliams, DEChen, HLaw, SKaleta, JVillanueva, IDavies, JEAndersen, RJBrömme, D Leupeptazin, a highly modified tripeptide isolated from cultures of a Streptomyces sp. inhibits cathepsin K. Bioorg Med Chem Lett27:1397-1400 (2017) 
 
Cathepsin K
Name:Cathepsin K
Type:Enzyme
Mol. Mass.:36975.68
Organism:Homo sapiens (Human)
Description:P43235
Residue:329
BDBM50213272
NameBDBM50213272
Synonyms:CHEBI:6426 | Leupeptin
TypeSmall organic molecule
Emp. Form.C20H38N6O4
Mol. Mass.426.5535
SMILESCC(C)C[C@H](NC(C)=O)C(=O)N[C@@H](CC(C)C)C(=O)N[C@@H](CCCNC(N)=N)C=O