Reaction Details
TargetTyrosine-protein kinase BTK
LigandBDBM50233391
Substrate/Competitorn/a
Meas. Tech.ChEMBL_1650766 (CHEMBL3999900)
IC50 0.300000±n/a nM
Citation Gao, XWang, JLiu, JGuiadeen, DKrikorian, ABoga, SBAlhassan, ABSelyutin, OYu, WYu, YAnand, RLiu, SYang, CWu, HCai, JCooper, AZhu, HMaloney, KGao, YDFischmann, TOPresland, JMansueto, MXu, ZLeccese, EZhang-Hoover, JKnemeyer, IGarlisi, CGBays, NStivers, PBrandish, PEHicks, AKim, RKozlowski, JA Discovery of novel BTK inhibitors with carboxylic acids. Bioorg Med Chem Lett27:1471-1477 (2017) 
 
Tyrosine-protein kinase BTK
Name:Tyrosine-protein kinase BTK
Type:Enzyme
Mol. Mass.:76289.95
Organism:Homo sapiens (Human)
Description:Q06187
Residue:659
BDBM50233391
NameBDBM50233391
Synonyms:CHEMBL4081444
TypeSmall organic molecule
Emp. Form.C29H27F3N6O3
Mol. Mass.564.5583
SMILESNc1nccn2c(nc(-c3ccc(cc3)C(=O)Nc3cc(ccn3)C(F)(F)F)c12)[C@@]12CC[C@@](CC1)(CCC2)C(O)=O