Reaction Details
TargetTyrosine-protein kinase BTK
LigandBDBM288439
Substrate/Competitorn/a
Meas. Tech.ChEMBL_1650766 (CHEMBL3999900)
IC50 1.1±n/a nM
Citation Gao, XWang, JLiu, JGuiadeen, DKrikorian, ABoga, SBAlhassan, ABSelyutin, OYu, WYu, YAnand, RLiu, SYang, CWu, HCai, JCooper, AZhu, HMaloney, KGao, YDFischmann, TOPresland, JMansueto, MXu, ZLeccese, EZhang-Hoover, JKnemeyer, IGarlisi, CGBays, NStivers, PBrandish, PEHicks, AKim, RKozlowski, JA Discovery of novel BTK inhibitors with carboxylic acids. Bioorg Med Chem Lett27:1471-1477 (2017) 
 
Tyrosine-protein kinase BTK
Name:Tyrosine-protein kinase BTK
Type:Enzyme
Mol. Mass.:76289.95
Organism:Homo sapiens (Human)
Description:Q06187
Residue:659
BDBM288439
NameBDBM288439
Synonyms:(1S,3R)-3-[8-amino-1- (4-{[4- (trifluoromethyl) pyridin-2- yl]carbamoyl}phenyl) imidazo[1,5-a]pyrazin- 3-yl]-1-(1- methylethyl) cyclopentane carboxylic acid | US10087188, Example 46
TypeSmall organic molecule
Emp. Form.C28H27F3N6O3
Mol. Mass.552.5476
SMILESCC(C)[C@@]1(CC[C@H](C1)c1nc(-c2ccc(cc2)C(=O)Nc2cc(ccn2)C(F)(F)F)c2c(N)nccn12)C(O)=O