Reaction Details
TargetTyrosine-protein kinase BTK
LigandBDBM50233394
Substrate/Competitorn/a
Meas. Tech.ChEMBL_1650767 (CHEMBL3999901)
IC50 17±n/a nM
Citation Gao, XWang, JLiu, JGuiadeen, DKrikorian, ABoga, SBAlhassan, ABSelyutin, OYu, WYu, YAnand, RLiu, SYang, CWu, HCai, JCooper, AZhu, HMaloney, KGao, YDFischmann, TOPresland, JMansueto, MXu, ZLeccese, EZhang-Hoover, JKnemeyer, IGarlisi, CGBays, NStivers, PBrandish, PEHicks, AKim, RKozlowski, JA Discovery of novel BTK inhibitors with carboxylic acids. Bioorg Med Chem Lett27:1471-1477 (2017) 
 
Tyrosine-protein kinase BTK
Name:Tyrosine-protein kinase BTK
Type:Enzyme
Mol. Mass.:76289.95
Organism:Homo sapiens (Human)
Description:Q06187
Residue:659
BDBM50233394
NameBDBM50233394
Synonyms:CHEMBL4079697
TypeSmall organic molecule
Emp. Form.C28H27F3N6O3
Mol. Mass.552.5476
SMILESC[C@]1(CC[C@@](C)(CC1)c1nc(-c2ccc(cc2)C(=O)Nc2cc(ccn2)C(F)(F)F)c2c(N)nccn12)C(O)=O