Reaction Details
TargetTyrosine-protein kinase BTK
LigandBDBM50233387
Substrate/Competitorn/a
Meas. Tech.ChEMBL_1650767 (CHEMBL3999901)
IC50 5.0±n/a nM
Citation Gao, XWang, JLiu, JGuiadeen, DKrikorian, ABoga, SBAlhassan, ABSelyutin, OYu, WYu, YAnand, RLiu, SYang, CWu, HCai, JCooper, AZhu, HMaloney, KGao, YDFischmann, TOPresland, JMansueto, MXu, ZLeccese, EZhang-Hoover, JKnemeyer, IGarlisi, CGBays, NStivers, PBrandish, PEHicks, AKim, RKozlowski, JA Discovery of novel BTK inhibitors with carboxylic acids. Bioorg Med Chem Lett27:1471-1477 (2017) 
 
Tyrosine-protein kinase BTK
Name:Tyrosine-protein kinase BTK
Type:Enzyme
Mol. Mass.:76289.95
Organism:Homo sapiens (Human)
Description:Q06187
Residue:659
BDBM50233387
NameBDBM50233387
Synonyms:CHEMBL4082411
TypeSmall organic molecule
Emp. Form.C27H25F3N10O
Mol. Mass.562.549
SMILESCn1nnc(n1)[C@H]1CCC[C@H](C1)c1nc(-c2ccc(cc2)C(=O)Nc2cc(ccn2)C(F)(F)F)c2c(N)nccn12