Reaction Details
TargetPhosphatidylinositol 4,5-bisphosphate 3-kinase catalytic subunit gamma isoform/Phosphoinositide 3-kinase regulatory subunit 5
LigandBDBM50233667
Substrate/Competitorn/a
Meas. Tech.ChEMBL_1651128 (CHEMBL4000383)
IC50 181±n/a nM
Citation Zhang, HXin, MHXie, XXMao, SZuo, SJLu, SMZhang, SQ Synthesis and antitumor activity evaluation of PI3K inhibitors containing 3-substituted quinazolin-4(3H)-one moiety. Bioorg Med Chem23:7765-76 (2015) 
 
Phosphatidylinositol 4,5-bisphosphate 3-kinase catalytic subunit gamma isoform/Phosphoinositide 3-kinase regulatory subunit 5
Name:Phosphatidylinositol 4,5-bisphosphate 3-kinase catalytic subunit gamma isoform/Phosphoinositide 3-kinase regulatory subunit 5
Type:Protein Complex
Mol. Mass.:n/a
Description:Heterodimer of a catalytic subunit (PIK3CG/p120) and a regulatory (PIK3R5a/p101) subunit.
Components:This complex has 2 components.
Component 1
Name:Phosphatidylinositol 4,5-bisphosphate 3-kinase catalytic subunit gamma isoform
Synonyms:PI3-kinase p110 subunit gamma PI3Kgamma PK3CG_HUMAN Phosphatidylinositol 4,5-bisphosphate 3-kinase (PI3K) Phosphatidylinositol 4,5-bisphosphate 3-kinase catalytic subunit gamma (PI3Kgamma) Phosphatidylinositol 4,5-bisphosphate 3-kinase catalytic subunit gamma isoform (PI3K) Phosphatidylinositol-4,5-bisphosphate 3-kinase catalytic subunit gamma isoform Phosphoinositide 3-kinases gamma (PI3K gamma) p120-PI3K
Type:Enzyme Subunit
Mol. Mass.:126470.30
Organism:Homo sapiens (Human)
Description:P48736
Residue:1102
Component 2
Name:Phosphoinositide 3-kinase regulatory subunit 5
Synonyms:IB PI3-kinase p101 subunit PI3R5_HUMAN Phosphatidylinositol-4,5-bisphosphate 3-kinase regulatory subunit Phosphoinositide 3-kinase regulatory subunit 5 p101-PI3K
Type:Enzyme Subunit
Mol. Mass.:97349.51
Organism:Homo sapiens (Human)
Description:Phosphoinositide 3-kinase regulatory subunit 5, p101-PI3K.
Residue:880
BDBM50233667
NameBDBM50233667
Synonyms:CHEMBL4088969
TypeSmall organic molecule
Emp. Form.C28H28FN5O4S
Mol. Mass.549.616
SMILESCOc1ncc(cc1NS(=O)(=O)c1ccc(F)cc1)-c1ccc2ncn([C@H]3CCN(CC4CC4)C3)c(=O)c2c1