Reaction Details
TargetCollagenase 3
LigandBDBM50233894
Substrate/Competitorn/a
Meas. Tech.ChEMBL_1651669 (CHEMBL4000924)
IC50 0.027000±n/a nM
Citation Nara, HKaieda, ASato, KNaito, TMototani, HOki, HYamamoto, YKuno, HSantou, TKanzaki, NTerauchi, JUchikawa, OKori, M Discovery of Novel, Highly Potent, and Selective Matrix Metalloproteinase (MMP)-13 Inhibitors with a 1,2,4-Triazol-3-yl Moiety as a Zinc Binding Group Using a Structure-Based Design Approach. J Med Chem60:608-626 (2017) 
 
Collagenase 3
Name:Collagenase 3
Type:Enzyme
Mol. Mass.:53808.06
Organism:Homo sapiens (Human)
Description:P45452
Residue:471
BDBM50233894
NameBDBM50233894
Synonyms:CHEMBL4079123
TypeSmall organic molecule
Emp. Form.C22H18N6O4S2
Mol. Mass.494.546
SMILESO=C(NCc1cccc(OCCOc2nc[nH]n2)c1)c1nc2scc(-c3cccs3)c2c(=O)[nH]1