Reaction Details
TargetCollagenase 3
LigandBDBM50233887
Substrate/Competitorn/a
Meas. Tech.ChEMBL_1651669 (CHEMBL4000924)
IC50 1900±n/a nM
Citation Nara, HKaieda, ASato, KNaito, TMototani, HOki, HYamamoto, YKuno, HSantou, TKanzaki, NTerauchi, JUchikawa, OKori, M Discovery of Novel, Highly Potent, and Selective Matrix Metalloproteinase (MMP)-13 Inhibitors with a 1,2,4-Triazol-3-yl Moiety as a Zinc Binding Group Using a Structure-Based Design Approach. J Med Chem60:608-626 (2017) 
 
Collagenase 3
Name:Collagenase 3
Type:Enzyme
Mol. Mass.:53808.06
Organism:Homo sapiens (Human)
Description:P45452
Residue:471
BDBM50233887
NameBDBM50233887
Synonyms:CHEMBL1511860
TypeSmall organic molecule
Emp. Form.C12H11N5S2
Mol. Mass.289.379
SMILESC(Sc1nc[nH]n1)c1csc(Nc2ccccc2)n1