Reaction Details
TargetNeutrophil collagenase
LigandBDBM50233887
Substrate/Competitorn/a
Meas. Tech.ChEMBL_1651671 (CHEMBL4000926)
IC50 9300±n/a nM
Citation Nara, HKaieda, ASato, KNaito, TMototani, HOki, HYamamoto, YKuno, HSantou, TKanzaki, NTerauchi, JUchikawa, OKori, M Discovery of Novel, Highly Potent, and Selective Matrix Metalloproteinase (MMP)-13 Inhibitors with a 1,2,4-Triazol-3-yl Moiety as a Zinc Binding Group Using a Structure-Based Design Approach. J Med Chem60:608-626 (2017) 
 
Neutrophil collagenase
Name:Neutrophil collagenase
Type:Enzyme
Mol. Mass.:53413.48
Organism:Homo sapiens (Human)
Description:P22894
Residue:467
BDBM50233887
NameBDBM50233887
Synonyms:CHEMBL1511860
TypeSmall organic molecule
Emp. Form.C12H11N5S2
Mol. Mass.289.379
SMILESC(Sc1nc[nH]n1)c1csc(Nc2ccccc2)n1