Reaction Details
TargetNeutrophil collagenase
LigandBDBM50233888
Substrate/Competitorn/a
Meas. Tech.ChEMBL_1651671 (CHEMBL4000926)
IC50 21±n/a nM
Citation Nara, HKaieda, ASato, KNaito, TMototani, HOki, HYamamoto, YKuno, HSantou, TKanzaki, NTerauchi, JUchikawa, OKori, M Discovery of Novel, Highly Potent, and Selective Matrix Metalloproteinase (MMP)-13 Inhibitors with a 1,2,4-Triazol-3-yl Moiety as a Zinc Binding Group Using a Structure-Based Design Approach. J Med Chem60:608-626 (2017) 
 
Neutrophil collagenase
Name:Neutrophil collagenase
Type:Enzyme
Mol. Mass.:53413.48
Organism:Homo sapiens (Human)
Description:P22894
Residue:467
BDBM50233888
NameBDBM50233888
Synonyms:CHEMBL4092215
TypeSmall organic molecule
Emp. Form.C20H20N6O3S2
Mol. Mass.456.541
SMILESCc1csc2nc([nH]c(=O)c12)C(=O)NCc1cccc(OCCCSc2nc[nH]n2)c1