Reaction Details
TargetInterstitial collagenase
LigandBDBM50233877
Substrate/Competitorn/a
Meas. Tech.ChEMBL_1651675 (CHEMBL4000930)
IC50>10000±n/a nM
Citation Nara, HKaieda, ASato, KNaito, TMototani, HOki, HYamamoto, YKuno, HSantou, TKanzaki, NTerauchi, JUchikawa, OKori, M Discovery of Novel, Highly Potent, and Selective Matrix Metalloproteinase (MMP)-13 Inhibitors with a 1,2,4-Triazol-3-yl Moiety as a Zinc Binding Group Using a Structure-Based Design Approach. J Med Chem60:608-626 (2017) 
 
Interstitial collagenase
Name:Interstitial collagenase
Type:Enzyme
Mol. Mass.:54010.26
Organism:Homo sapiens (Human)
Description: P03956
Residue:469
BDBM50233877
NameBDBM50233877
Synonyms:CHEMBL4068176
TypeSmall organic molecule
Emp. Form.C24H19FN6O4S
Mol. Mass.506.509
SMILESFc1cccc(c1)-c1csc2nc([nH]c(=O)c12)C(=O)NCc1cccc(OCCOc2nc[nH]n2)c1