Reaction Details
TargetMatrix metalloproteinase-9
LigandBDBM50233887
Substrate/Competitorn/a
Meas. Tech.ChEMBL_1651678 (CHEMBL4000933)
IC50 2200±n/a nM
Citation Nara, HKaieda, ASato, KNaito, TMototani, HOki, HYamamoto, YKuno, HSantou, TKanzaki, NTerauchi, JUchikawa, OKori, M Discovery of Novel, Highly Potent, and Selective Matrix Metalloproteinase (MMP)-13 Inhibitors with a 1,2,4-Triazol-3-yl Moiety as a Zinc Binding Group Using a Structure-Based Design Approach. J Med Chem60:608-626 (2017) 
 
Matrix metalloproteinase-9
Name:Matrix metalloproteinase-9
Type:Enzyme
Mol. Mass.:78452.28
Organism:Homo sapiens (Human)
Description:P14780
Residue:707
BDBM50233887
NameBDBM50233887
Synonyms:CHEMBL1511860
TypeSmall organic molecule
Emp. Form.C12H11N5S2
Mol. Mass.289.379
SMILESC(Sc1nc[nH]n1)c1csc(Nc2ccccc2)n1