Reaction Details
Target72 kDa type IV collagenase
LigandBDBM50233892
Substrate/Competitorn/a
Meas. Tech.ChEMBL_1651670 (CHEMBL4000925)
IC50 14±n/a nM
Citation Nara, HKaieda, ASato, KNaito, TMototani, HOki, HYamamoto, YKuno, HSantou, TKanzaki, NTerauchi, JUchikawa, OKori, M Discovery of Novel, Highly Potent, and Selective Matrix Metalloproteinase (MMP)-13 Inhibitors with a 1,2,4-Triazol-3-yl Moiety as a Zinc Binding Group Using a Structure-Based Design Approach. J Med Chem60:608-626 (2017) 
 
72 kDa type IV collagenase
Name:72 kDa type IV collagenase
Type:Enzyme
Mol. Mass.:73870.36
Organism:Homo sapiens (Human)
Description: P08253
Residue:660
BDBM50233892
NameBDBM50233892
Synonyms:CHEMBL4068241
TypeSmall organic molecule
Emp. Form.C19H18N6O4S
Mol. Mass.426.449
SMILESCc1csc2nc([nH]c(=O)c12)C(=O)NCc1cccc(OCCOc2nc[nH]n2)c1