Reaction Details
TargetGlutamate receptor ionotropic, kainate 1
LigandBDBM50200526
Substrate/Competitorn/a
Meas. Tech.ChEMBL_1652084 (CHEMBL4001339)
Ki 50±n/a nM
Citation Krogsgaard-Larsen, NDelgar, CGKoch, KBrown, PMMøller, CHan, LHuynh, THHansen, SWNielsen, BBowie, DPickering, DSKastrup, JSFrydenvang, KBunch, L Design and Synthesis of a Series of l-trans-4-Substituted Prolines as Selective Antagonists for the Ionotropic Glutamate Receptors Including Functional and X-ray Crystallographic Studies of New Subtype Selective Kainic Acid Receptor Subtype 1 (GluK1) Antagonist (2S,4R)-4-(2-Carboxyphenoxy)pyrrolidin J Med Chem60:441-457 (2017) 
 
Glutamate receptor ionotropic, kainate 1
Name:Glutamate receptor ionotropic, kainate 1
Type:Enzyme Catalytic Domain
Mol. Mass.:103984.96
Organism:Homo sapiens (Human)
Description:P39086
Residue:918
BDBM50200526
NameBDBM50200526
Synonyms:CHEMBL1234118
TypeSmall organic molecule
Emp. Form.C16H24F2N2O4
Mol. Mass.346.3696
SMILESOC(=O)[C@@H]1CC(F)(F)CN1C[C@H]1CC[C@H]2CN[C@@H](C[C@H]2C1)C(O)=O