Reaction Details
TargetPolyphenol oxidase 2
LigandBDBM50234119
Substrate/Competitorn/a
Meas. Tech.ChEMBL_1652196 (CHEMBL4001451)
IC50 1710±n/a nM
Citation Xie, WZhang, HHe, JZhang, JYu, QLuo, CLi, S Synthesis and biological evaluation of novel hydroxybenzaldehyde-based kojic acid analogues as inhibitors of mushroom tyrosinase. Bioorg Med Chem Lett27:530-532 (2017) 
 
Polyphenol oxidase 2
Name:Polyphenol oxidase 2
Type:Protein
Mol. Mass.:63923.66
Organism:Agaricus bisporus (Common mushroom)
Description:O42713
Residue:556
BDBM50234119
NameBDBM50234119
Synonyms:CHEMBL4067785
TypeSmall organic molecule
Emp. Form.C21H17ClN4O4S
Mol. Mass.456.902
SMILESOc1ccccc1CNn1c(SCc2cc(=O)c(O)co2)nnc1-c1ccc(Cl)cc1