Reaction Details
TargetCoagulation factor X
LigandBDBM50234132
Substrate/Competitorn/a
Meas. Tech.ChEMBL_1652332 (CHEMBL4001587)
IC50 19.9±n/a nM
Citation Zhang, GQJin, HZhao, YGuo, LGao, XWang, XTie, SShen, JWang, PGGan, HCui, HZhao, W An efficient anticoagulant candidate: Characterization, synthesis and in vivo study of a fondaparinux analogue Rrt1.17. Eur J Med Chem126:1039-1055 (2017) 
 
Coagulation factor X
Name:Coagulation factor X
Type:Enzyme
Mol. Mass.:54726.60
Organism:Homo sapiens (Human)
Description:n/a
Residue:488
BDBM50234132
NameBDBM50234132
Synonyms:CHEMBL4085202
TypeSmall organic molecule
Emp. Form.C31H43N3Na8O45S7
Mol. Mass.1586.039
SMILES[Na+].[Na+].[Na+].[Na+].[Na+].[Na+].[Na+].[Na+].[H][C@@]1(O[C@H]2[C@H](O)[C@@H](NS([O-])(=O)=O)[C@@H](OC)O[C@@H]2COS([O-])(=O)=O)O[C@@]2([H])C(=O)N[C@]3([H])[C@@H](OS([O-])(=O)=O)[C@]([H])(O[C@@H]4O[C@H](C([O-])=O)[C@@]([H])(O[C@H]5O[C@H](COS([O-])(=O)=O)[C@@H](O)[C@H](O)[C@H]5NS([O-])(=O)=O)[C@H](O)[C@H]4O)[C@@H](COS([O-])(=O)=O)O[C@@]3([H])O[C@]2([H])[C@H](O)[C@H]1OS([O-])(=O)=O