Reaction Details
TargetAlpha-galactosidase A
LigandBDBM50234563
Substrate/Competitorn/a
Meas. Tech.ChEMBL_1653300 (CHEMBL4002666)
IC50 7700±n/a nM
Citation Cheng, WCWang, JHYun, WYLi, HYHu, JM Rapid preparation of (3R,4S,5R) polyhydroxylated pyrrolidine-based libraries to discover a pharmacological chaperone for treatment of Fabry disease. Eur J Med Chem126:1-6 (2017) 
 
Alpha-galactosidase A
Name:Alpha-galactosidase A
Type:Protein
Mol. Mass.:48760.21
Organism:Homo sapiens (Human)
Description:n/a
Residue:429
BDBM50234563
NameBDBM50234563
Synonyms:CHEMBL4072729
TypeSmall organic molecule
Emp. Form.C18H28N2O7
Mol. Mass.384.4241
SMILESCOc1cc(OC)c(OC)cc1CCC(=O)NC[C@H]1N[C@H](CO)[C@H](O)[C@@H]1O