Reaction Details
TargetAlkaline phosphatase, tissue-nonspecific isozyme
LigandBDBM50234710
Substrate/Competitorn/a
Meas. Tech.ChEMBL_1653676 (CHEMBL4003042)
IC50 2560±n/a nM
Citation Miliutina, MEjaz, SAKhan, SUIaroshenko, VOVillinger, AIqbal, JLanger, P Synthesis, alkaline phosphatase inhibition studies and molecular docking of novel derivatives of 4-quinolones. Eur J Med Chem126:408-420 (2017) 
 
Alkaline phosphatase, tissue-nonspecific isozyme
Name:Alkaline phosphatase, tissue-nonspecific isozyme
Type:Protein
Mol. Mass.:57195.60
Organism:Bos taurus (Cattle)
Description:P09487
Residue:524
BDBM50234710
NameBDBM50234710
Synonyms:CHEMBL4084870
TypeSmall organic molecule
Emp. Form.C16H12N2O3
Mol. Mass.280.2781
SMILESCc1ccc(cc1)-c1cc(=O)c2cc(ccc2[nH]1)[N+]([O-])=O