Reaction Details
TargetAlkaline phosphatase, tissue-nonspecific isozyme
LigandBDBM50234711
Substrate/Competitorn/a
Meas. Tech.ChEMBL_1653676 (CHEMBL4003042)
IC50 6470±n/a nM
Citation Miliutina, MEjaz, SAKhan, SUIaroshenko, VOVillinger, AIqbal, JLanger, P Synthesis, alkaline phosphatase inhibition studies and molecular docking of novel derivatives of 4-quinolones. Eur J Med Chem126:408-420 (2017) 
 
Alkaline phosphatase, tissue-nonspecific isozyme
Name:Alkaline phosphatase, tissue-nonspecific isozyme
Type:Protein
Mol. Mass.:57195.60
Organism:Bos taurus (Cattle)
Description:P09487
Residue:524
BDBM50234711
NameBDBM50234711
Synonyms:CHEMBL4066789
TypeSmall organic molecule
Emp. Form.C16H11BrN2O3
Mol. Mass.359.174
SMILESCc1ccc(cc1)-c1[nH]c2ccc(cc2c(=O)c1Br)[N+]([O-])=O