Reaction Details
TargetAlkaline phosphatase, tissue-nonspecific isozyme
LigandBDBM50234716
Substrate/Competitorn/a
Meas. Tech.ChEMBL_1653676 (CHEMBL4003042)
IC50 6020±n/a nM
Citation Miliutina, MEjaz, SAKhan, SUIaroshenko, VOVillinger, AIqbal, JLanger, P Synthesis, alkaline phosphatase inhibition studies and molecular docking of novel derivatives of 4-quinolones. Eur J Med Chem126:408-420 (2017) 
 
Alkaline phosphatase, tissue-nonspecific isozyme
Name:Alkaline phosphatase, tissue-nonspecific isozyme
Type:Protein
Mol. Mass.:57195.60
Organism:Bos taurus (Cattle)
Description:P09487
Residue:524
BDBM50234716
NameBDBM50234716
Synonyms:CHEMBL4104441
TypeSmall organic molecule
Emp. Form.C25H19F3N2O2
Mol. Mass.436.4258
SMILESCc1ccc(cc1)-c1[nH]c2ccc(NC(=O)C(F)(F)F)cc2c(=O)c1-c1ccc(C)cc1