Reaction Details
TargetCholinesterase
LigandBDBM50234795
Substrate/Competitorn/a
Meas. Tech.ChEMBL_1653963 (CHEMBL4003329)
Ki 0.131000±n/a nM
Citation Heller, LKahnt, MLoesche, AGrabandt, PSchwarz, SBrandt, WCsuk, R Amino derivatives of platanic acid act as selective and potent inhibitors of butyrylcholinesterase. Eur J Med Chem126:652-668 (2017) 
 
Cholinesterase
Name:Cholinesterase
Type:Homotetramer
Mol. Mass.:68422.27
Organism:Homo sapiens (Human)
Description:P06276
Residue:602
BDBM50234795
NameBDBM50234795
Synonyms:CHEMBL4089082
TypeSmall organic molecule
Emp. Form.C21H25N3O2
Mol. Mass.351.4421
SMILES[H][C@]12NCC[C@@]1(C)c1cc(OC(=O)Nc3ccc(cc3)C(C)C)ccc1N2