Reaction Details
TargetAmine oxidase [flavin-containing] A
LigandBDBM15581
Substrate/Competitorn/a
Meas. Tech.ChEMBL_1654033 (CHEMBL4003399)
IC50 2.7±n/a nM
Citation Li, YQiang, XLuo, LYang, XXiao, GLiu, QAi, JTan, ZDeng, Y Aurone Mannich base derivatives as promising multifunctional agents with acetylcholinesterase inhibition, anti-ß-amyloid aggragation and neuroprotective properties for the treatment of Alzheimer's disease. Eur J Med Chem126:762-775 (2017) 
 
Amine oxidase [flavin-containing] A
Name:Amine oxidase [flavin-containing] A
Type:Protein
Mol. Mass.:59689.53
Organism:Homo sapiens (Human)
Description:P21397
Residue:527
BDBM15581
NameBDBM15581
Synonyms:CHEMBL8706 CLORGILINE N-[3-(2,4-dichlorophenoxy)propyl]-N-methyl-prop-2-yn-1-amine US9603833, Clorgyline | [3-(2,4-dichlorophenoxy)propyl](methyl)prop-2-yn-1-ylamine
TypeSmall organic molecule
Emp. Form.C13H15Cl2NO
Mol. Mass.272.17
SMILESCN(CCCOc1ccc(Cl)cc1Cl)CC#C