Reaction Details
TargetTyrosine-protein kinase JAK2
LigandBDBM50234902
Substrate/Competitorn/a
Meas. Tech.ChEMBL_1654087 (CHEMBL4003453)
IC50 5.4±n/a nM
Citation Jones, PStorer, RISabnis, YAWakenhut, FMWhitlock, GAEngland, KSMukaiyama, TDehnhardt, CMCoe, JWKortum, SWChrencik, JEBrown, DGJones, RMMurphy, JRYeoh, TMorgan, PKilty, I Design and Synthesis of a Pan-Janus Kinase Inhibitor Clinical Candidate (PF-06263276) Suitable for Inhaled and Topical Delivery for the Treatment of Inflammatory Diseases of the Lungs and Skin. J Med Chem60:767-786 (2017) 
 
Tyrosine-protein kinase JAK2
Name:Tyrosine-protein kinase JAK2
Type:Protein
Mol. Mass.:130684.68
Organism:Homo sapiens (Human)
Description:O60674
Residue:1132
BDBM50234902
NameBDBM50234902
Synonyms:CHEMBL3914503
TypeSmall organic molecule
Emp. Form.C21H16N4O2
Mol. Mass.356.3773
SMILESCOc1cc(O)ccc1-c1ccc2c(n[nH]c2c1)-c1nc2ccccc2[nH]1