Reaction Details
TargetNon-receptor tyrosine-protein kinase TYK2
LigandBDBM50234899
Substrate/Competitorn/a
Meas. Tech.ChEMBL_1654084 (CHEMBL4003450)
IC50 959±n/a nM
Citation Jones, PStorer, RISabnis, YAWakenhut, FMWhitlock, GAEngland, KSMukaiyama, TDehnhardt, CMCoe, JWKortum, SWChrencik, JEBrown, DGJones, RMMurphy, JRYeoh, TMorgan, PKilty, I Design and Synthesis of a Pan-Janus Kinase Inhibitor Clinical Candidate (PF-06263276) Suitable for Inhaled and Topical Delivery for the Treatment of Inflammatory Diseases of the Lungs and Skin. J Med Chem60:767-786 (2017) 
 
Non-receptor tyrosine-protein kinase TYK2
Name:Non-receptor tyrosine-protein kinase TYK2
Type:Protein
Mol. Mass.:133666.03
Organism:Homo sapiens (Human)
Description:P29597
Residue:1187
BDBM50234899
NameBDBM50234899
Synonyms:CHEMBL4089515
TypeSmall organic molecule
Emp. Form.C24H30N6O4S
Mol. Mass.498.598
SMILESC[C@@H]1CCN(C[C@@H]1N(C)c1ncnc2[nH]ccc12)C(=O)N1CC[C@H](C1)S(=O)(=O)c1cccc(O)c1