Reaction Details
TargetNon-receptor tyrosine-protein kinase TYK2
LigandBDBM50234902
Substrate/Competitorn/a
Meas. Tech.ChEMBL_1654084 (CHEMBL4003450)
IC50 102±n/a nM
Citation Jones, PStorer, RISabnis, YAWakenhut, FMWhitlock, GAEngland, KSMukaiyama, TDehnhardt, CMCoe, JWKortum, SWChrencik, JEBrown, DGJones, RMMurphy, JRYeoh, TMorgan, PKilty, I Design and Synthesis of a Pan-Janus Kinase Inhibitor Clinical Candidate (PF-06263276) Suitable for Inhaled and Topical Delivery for the Treatment of Inflammatory Diseases of the Lungs and Skin. J Med Chem60:767-786 (2017) 
 
Non-receptor tyrosine-protein kinase TYK2
Name:Non-receptor tyrosine-protein kinase TYK2
Type:Protein
Mol. Mass.:133666.03
Organism:Homo sapiens (Human)
Description:P29597
Residue:1187
BDBM50234902
NameBDBM50234902
Synonyms:CHEMBL3914503
TypeSmall organic molecule
Emp. Form.C21H16N4O2
Mol. Mass.356.3773
SMILESCOc1cc(O)ccc1-c1ccc2c(n[nH]c2c1)-c1nc2ccccc2[nH]1