Reaction Details
TargetTyrosine-protein kinase JAK2
LigandBDBM50234899
Substrate/Competitorn/a
Meas. Tech.ChEMBL_1654087 (CHEMBL4003453)
IC50 21±n/a nM
Citation Jones, PStorer, RISabnis, YAWakenhut, FMWhitlock, GAEngland, KSMukaiyama, TDehnhardt, CMCoe, JWKortum, SWChrencik, JEBrown, DGJones, RMMurphy, JRYeoh, TMorgan, PKilty, I Design and Synthesis of a Pan-Janus Kinase Inhibitor Clinical Candidate (PF-06263276) Suitable for Inhaled and Topical Delivery for the Treatment of Inflammatory Diseases of the Lungs and Skin. J Med Chem60:767-786 (2017) 
 
Tyrosine-protein kinase JAK2
Name:Tyrosine-protein kinase JAK2
Type:Protein
Mol. Mass.:130684.68
Organism:Homo sapiens (Human)
Description:O60674
Residue:1132
BDBM50234899
NameBDBM50234899
Synonyms:CHEMBL4089515
TypeSmall organic molecule
Emp. Form.C24H30N6O4S
Mol. Mass.498.598
SMILESC[C@@H]1CCN(C[C@@H]1N(C)c1ncnc2[nH]ccc12)C(=O)N1CC[C@H](C1)S(=O)(=O)c1cccc(O)c1