Reaction Details
TargetHistone acetyltransferase KAT2B
LigandBDBM50150068
Substrate/Competitorn/a
Meas. Tech.ChEMBL_1654184 (CHEMBL4003550)
Kd 6800±n/a nM
Citation Humphreys, PGBamborough, PChung, CWCraggs, PDGordon, LGrandi, PHayhow, TGHussain, JJones, KLLindon, MMichon, AMRenaux, JFSuckling, CJTough, DFPrinjha, RK Discovery of a Potent, Cell Penetrant, and Selective p300/CBP-Associated Factor (PCAF)/General Control Nonderepressible 5 (GCN5) Bromodomain Chemical Probe. J Med Chem60:695-709 (2017) 
 
Histone acetyltransferase KAT2B
Name:Histone acetyltransferase KAT2B
Type:PROTEIN
Mol. Mass.:93045.76
Organism:Homo sapiens (Human)
Description:ChEMBL_1502838
Residue:832
BDBM50150068
NameBDBM50150068
Synonyms:CHEMBL3775323
TypeSmall organic molecule
Emp. Form.C21H24N2O5
Mol. Mass.384.4257
SMILESCNC(=O)c1cc(OCC(=O)Nc2ccccc2)ccc1OC1CCOCC1