Reaction Details
TargetHistone acetyltransferase KAT2B
LigandBDBM50234932
Substrate/Competitorn/a
Meas. Tech.ChEMBL_1654184 (CHEMBL4003550)
IC50 13±n/a nM
Citation Humphreys, PGBamborough, PChung, CWCraggs, PDGordon, LGrandi, PHayhow, TGHussain, JJones, KLLindon, MMichon, AMRenaux, JFSuckling, CJTough, DFPrinjha, RK Discovery of a Potent, Cell Penetrant, and Selective p300/CBP-Associated Factor (PCAF)/General Control Nonderepressible 5 (GCN5) Bromodomain Chemical Probe. J Med Chem60:695-709 (2017) 
 
Histone acetyltransferase KAT2B
Name:Histone acetyltransferase KAT2B
Type:PROTEIN
Mol. Mass.:93045.76
Organism:Homo sapiens (Human)
Description:ChEMBL_1502838
Residue:832
BDBM50234932
NameBDBM50234932
Synonyms:CHEMBL4103402 | US10239861, Example 20
TypeSmall organic molecule
Emp. Form.C15H25ClN4O
Mol. Mass.312.838
SMILESCC(C)C[C@H]1C[C@H](CN(C)C1)Nc1cnn(C)c(=O)c1Cl