Reaction Details
TargetBromodomain-containing protein 9
LigandBDBM50234923
Substrate/Competitorn/a
Meas. Tech.ChEMBL_1654193 (CHEMBL4003559)
IC50 7943±n/a nM
Citation Humphreys, PGBamborough, PChung, CWCraggs, PDGordon, LGrandi, PHayhow, TGHussain, JJones, KLLindon, MMichon, AMRenaux, JFSuckling, CJTough, DFPrinjha, RK Discovery of a Potent, Cell Penetrant, and Selective p300/CBP-Associated Factor (PCAF)/General Control Nonderepressible 5 (GCN5) Bromodomain Chemical Probe. J Med Chem60:695-709 (2017) 
 
Bromodomain-containing protein 9
Name:Bromodomain-containing protein 9
Type:PROTEIN
Mol. Mass.:66994.30
Organism:Homo sapiens (Human)
Description:ChEMBL_108000
Residue:597
BDBM50234923
NameBDBM50234923
Synonyms:CHEMBL4069412
TypeSmall organic molecule
Emp. Form.C17H21BrN4O
Mol. Mass.377.279
SMILESCN1C[C@@H](C[C@@H](C1)c1ccccc1)Nc1cnn(C)c(=O)c1Br