Reaction Details
TargetSerine/threonine-protein kinase Nek2
LigandBDBM50235010
Substrate/Competitorn/a
Meas. Tech.ChEMBL_1654329 (CHEMBL4003695)
IC50 591±n/a nM
Citation Xi, JBFang, YFFrett, BZhu, MLZhu, TKong, YNGuan, FJZhao, YZhang, XWLi, HYMa, MLHu, W Structure-based design and synthesis of imidazo[1,2-a]pyridine derivatives as novel and potent Nek2 inhibitors with in vitro and in vivo antitumor activities. Eur J Med Chem126:1083-1106 (2017) 
 
Serine/threonine-protein kinase Nek2
Name:Serine/threonine-protein kinase Nek2
Type:Enzyme
Mol. Mass.:51776.96
Organism:Homo sapiens (Human)
Description:P51955
Residue:445
BDBM50235010
NameBDBM50235010
Synonyms:CHEMBL4062949
TypeSmall organic molecule
Emp. Form.C29H29F3N4O3
Mol. Mass.538.5608
SMILESC[C@@H](Oc1cc(ccc1C(N)=O)-c1cnc2cc(OC3CCN(C)CC3)ccn12)c1ccccc1C(F)(F)F