Reaction Details
TargetProtein kinase C beta type
LigandBDBM50235288
Substrate/Competitorn/a
Meas. Tech.ChEMBL_1655175 (CHEMBL4004541)
IC50 1.4±n/a nM
Citation van Eis, MJEvenou, JSchuler, WZenke, GVangrevelinghe, EWagner, Jvon Matt, P Indolyl-naphthyl-maleimides as potent and selective inhibitors of protein kinase C-a/ß. Bioorg Med Chem Lett27:781-786 (2017) 
 
Protein kinase C beta type
Name:Protein kinase C beta type
Type:Enzyme
Mol. Mass.:76873.67
Organism:Homo sapiens (Human)
Description:The recombinant human PKC enzymes were produced using a baculovirus expression system in SF9 cells
Residue:671
BDBM50235288
NameBDBM50235288
Synonyms:CHEMBL4072879
TypeSmall organic molecule
Emp. Form.C25H20ClN3O2
Mol. Mass.429.898
SMILESCNCc1ccc2ccc(Cl)c(C3=C(C(=O)NC3=O)c3cn(C)c4ccccc34)c2c1