Reaction Details
TargetProtein kinase C alpha type
LigandBDBM50235287
Substrate/Competitorn/a
Meas. Tech.ChEMBL_1655174 (CHEMBL4004540)
IC50 3.4±n/a nM
Citation van Eis, MJEvenou, JSchuler, WZenke, GVangrevelinghe, EWagner, Jvon Matt, P Indolyl-naphthyl-maleimides as potent and selective inhibitors of protein kinase C-a/ß. Bioorg Med Chem Lett27:781-786 (2017) 
 
Protein kinase C alpha type
Name:Protein kinase C alpha type
Type:Enzyme
Mol. Mass.:76755.65
Organism:Homo sapiens (Human)
Description:The recombinant human PKC enzymes were produced using a baculovirus expression system in SF9 cells
Residue:672
BDBM50235287
NameBDBM50235287
Synonyms:CHEMBL4089217
TypeSmall organic molecule
Emp. Form.C27H22ClN3O2
Mol. Mass.455.935
SMILESCn1cc(C2=C(C(=O)NC2=O)c2c(Cl)ccc3ccc(CN4CCC4)cc23)c2ccccc12