Reaction Details
TargetProtein kinase C beta type
LigandBDBM50235282
Substrate/Competitorn/a
Meas. Tech.ChEMBL_1655194 (CHEMBL4004560)
IC50 296±n/a nM
Citation van Eis, MJEvenou, JSchuler, WZenke, GVangrevelinghe, EWagner, Jvon Matt, P Indolyl-naphthyl-maleimides as potent and selective inhibitors of protein kinase C-a/ß. Bioorg Med Chem Lett27:781-786 (2017) 
 
Protein kinase C beta type
Name:Protein kinase C beta type
Type:Enzyme Mixture
Mol. Mass.:76755.54
Organism:Rattus norvegicus (rat)
Description:PKC from rat brain is known to contain predominately the conventional PKC isoforms, alpha, beta I, beta II, gamma.
Residue:671
BDBM50235282
NameBDBM50235282
Synonyms:CHEMBL4077967
TypeSmall organic molecule
Emp. Form.C26H22ClN3O2
Mol. Mass.443.925
SMILESCN(C)Cc1ccc2ccc(Cl)c(C3=C(C(=O)NC3=O)c3cn(C)c4ccccc34)c2c1