Reaction Details
TargetCyclin-dependent kinase 2
LigandBDBM50235359
Substrate/Competitorn/a
Meas. Tech.ChEMBL_1655478 (CHEMBL4004948)
IC50 0.800000±n/a nM
Citation Coxon, CRAnscombe, EHarnor, SJMartin, MPCarbain, BGolding, BTHardcastle, IRHarlow, LKKorolchuk, SMatheson, CJNewell, DRNoble, MESivaprakasam, MTudhope, SJTurner, DMWang, LZWedge, SRWong, CGriffin, RJEndicott, JACano, C Cyclin-Dependent Kinase (CDK) Inhibitors: Structure-Activity Relationships and Insights into the CDK-2 Selectivity of 6-Substituted 2-Arylaminopurines. J Med Chem60:1746-1767 (2017) 
 
Cyclin-dependent kinase 2
Name:Cyclin-dependent kinase 2
Type:Enzyme Subunit
Mol. Mass.:33938.17
Organism:Homo sapiens (Human)
Description:P24941
Residue:298
BDBM50235359
NameBDBM50235359
Synonyms:CHEMBL4088242
TypeSmall organic molecule
Emp. Form.C15H19N5O4S
Mol. Mass.365.407
SMILESCC[C@@H](C)Oc1nc(Nc2ccc(cc2)S(N)(=O)=O)nc(N)c1C=O