Reaction Details
TargetPolycomb protein EED
LigandBDBM50235640
Substrate/Competitorn/a
Meas. Tech.ChEMBL_1657638 (CHEMBL4007108)
Ki 78±n/a nM
Citation Curtin, MLPliushchev, MALi, HQTorrent, MDietrich, JDJakob, CGZhu, HZhao, HWang, YJi, ZClark, RFSarris, KASelvaraju, SShaw, BAlgire, MAHe, YRichardson, PLSweis, RFSun, CChiang, GGMichaelides, MR SAR of amino pyrrolidines as potent and novel protein-protein interaction inhibitors of the PRC2 complex through EED binding. Bioorg Med Chem Lett27:1576-1583 (2017) 
 
Polycomb protein EED
Name:Polycomb protein EED
Type:Protein
Mol. Mass.:50201.68
Organism:Homo sapiens (Human)
Description:O75530
Residue:441
BDBM50235640
NameBDBM50235640
Synonyms:CHEMBL4084449
TypeSmall organic molecule
Emp. Form.C25H31N3
Mol. Mass.373.5337
SMILESCN(C)[C@H]1CN(C[C@@H]1c1cn(C)c2ccccc12)[C@H]1CCCc2ccccc12