Reaction Details
TargetPolycomb protein EED
LigandBDBM223986
Substrate/Competitorn/a
Meas. Tech.ChEMBL_1657638 (CHEMBL4007108)
Ki 11±n/a nM
Citation Curtin, MLPliushchev, MALi, HQTorrent, MDietrich, JDJakob, CGZhu, HZhao, HWang, YJi, ZClark, RFSarris, KASelvaraju, SShaw, BAlgire, MAHe, YRichardson, PLSweis, RFSun, CChiang, GGMichaelides, MR SAR of amino pyrrolidines as potent and novel protein-protein interaction inhibitors of the PRC2 complex through EED binding. Bioorg Med Chem Lett27:1576-1583 (2017) 
 
Polycomb protein EED
Name:Polycomb protein EED
Type:Protein
Mol. Mass.:50201.68
Organism:Homo sapiens (Human)
Description:O75530
Residue:441
BDBM223986
NameBDBM223986
Synonyms:(3R,4S)-1-[(1S)-7-fluoroindan-1-yl]-N,N-dimethyl-4-(1-methylindol-3-yl)pyrrolidin-3-amine (3)
TypeSmall organic molecule
Emp. Form.C24H28FN3
Mol. Mass.377.4976
SMILESCN(C)[C@H]1CN(C[C@@H]1c1cn(C)c2ccccc12)[C@H]1CCc2cccc(F)c12