Reaction Details
TargetPolycomb protein EED
LigandBDBM50235657
Substrate/Competitorn/a
Meas. Tech.ChEMBL_1657638 (CHEMBL4007108)
Ki 49±n/a nM
Citation Curtin, MLPliushchev, MALi, HQTorrent, MDietrich, JDJakob, CGZhu, HZhao, HWang, YJi, ZClark, RFSarris, KASelvaraju, SShaw, BAlgire, MAHe, YRichardson, PLSweis, RFSun, CChiang, GGMichaelides, MR SAR of amino pyrrolidines as potent and novel protein-protein interaction inhibitors of the PRC2 complex through EED binding. Bioorg Med Chem Lett27:1576-1583 (2017) 
 
Polycomb protein EED
Name:Polycomb protein EED
Type:Protein
Mol. Mass.:50201.68
Organism:Homo sapiens (Human)
Description:O75530
Residue:441
BDBM50235657
NameBDBM50235657
Synonyms:CHEMBL4065124
TypeSmall organic molecule
Emp. Form.C18H21BrFN3
Mol. Mass.378.282
SMILESCN(C)[C@H]1CN(Cc2c(F)cccc2Br)C[C@@H]1c1ccncc1