Reaction Details
TargetPolycomb protein EED
LigandBDBM50235660
Substrate/Competitorn/a
Meas. Tech.ChEMBL_1657638 (CHEMBL4007108)
Ki 4.6±n/a nM
Citation Curtin, MLPliushchev, MALi, HQTorrent, MDietrich, JDJakob, CGZhu, HZhao, HWang, YJi, ZClark, RFSarris, KASelvaraju, SShaw, BAlgire, MAHe, YRichardson, PLSweis, RFSun, CChiang, GGMichaelides, MR SAR of amino pyrrolidines as potent and novel protein-protein interaction inhibitors of the PRC2 complex through EED binding. Bioorg Med Chem Lett27:1576-1583 (2017) 
 
Polycomb protein EED
Name:Polycomb protein EED
Type:Protein
Mol. Mass.:50201.68
Organism:Homo sapiens (Human)
Description:O75530
Residue:441
BDBM50235660
NameBDBM50235660
Synonyms:CHEMBL4072329
TypeSmall organic molecule
Emp. Form.C27H35FN4O3S
Mol. Mass.514.655
SMILESCN(C)[C@H]1CN(Cc2c(C)cccc2F)C[C@@H]1c1ccc(nc1)C1=CCN(CC1)C(=O)CS(C)(=O)=O