Reaction Details
TargetVitamin K epoxide reductase complex subunit 1
LigandBDBM50235668
Substrate/Competitorn/a
Meas. Tech.ChEMBL_1657647 (CHEMBL4007117)
Ki 50±n/a nM
Citation Montagut-Romans, ABoulven, MJacolot, MMoebs-Sanchez, SHascoët, CHammed, ABesse, SLemaire, MBenoit, ELattard, VPopowycz, F Synthesis and biological evaluation of C-3 aliphatic coumarins as vitamin K antagonists. Bioorg Med Chem Lett27:1598-1601 (2017) 
 
Vitamin K epoxide reductase complex subunit 1
Name:Vitamin K epoxide reductase complex subunit 1
Type:Enzyme
Mol. Mass.:17793.51
Organism:Rattus norvegicus (Rat)
Description:Q6TEK4
Residue:161
BDBM50235668
NameBDBM50235668
Synonyms:CHEMBL4098946
TypeSmall organic molecule
Emp. Form.C29H46O3
Mol. Mass.442.6737
SMILESCC(C)CCCC(C)CCCC(C)CCCC(C)CCc1c(O)c2ccccc2oc1=O