Reaction Details
TargetHistone deacetylase 4
LigandBDBM50235704
Substrate/Competitorn/a
Meas. Tech.ChEMBL_1657750 (CHEMBL4007220)
Ki>50000±n/a nM
Citation Meyners, CWolff, BKleinschek, AKrämer, AMeyer-Almes, FJ Perfluorinated hydroxamic acids are potent and selective inhibitors of HDAC-like enzymes from Pseudomonas aeruginosa. Bioorg Med Chem Lett27:1508-1512 (2017) 
 
Histone deacetylase 4
Name:Histone deacetylase 4
Type:Enzyme
Mol. Mass.:119049.39
Organism:Homo sapiens (Human)
Description:P56524
Residue:1084
BDBM50235704
NameBDBM50235704
Synonyms:CHEMBL4066343
TypeSmall organic molecule
Emp. Form.C22H13F12N5O3
Mol. Mass.623.3512
SMILESONC(=O)C(F)(F)C(F)(F)C(F)(F)C(F)(F)C(F)(F)C(F)(F)C(=O)Nc1cccc(c1)-c1cn(nn1)-c1ccccc1