Reaction Details
TargetHistone deacetylase 5
LigandBDBM50361260
Substrate/Competitorn/a
Meas. Tech.ChEMBL_1657751 (CHEMBL4007221)
Ki>50000±n/a nM
Citation Meyners, CWolff, BKleinschek, AKrämer, AMeyer-Almes, FJ Perfluorinated hydroxamic acids are potent and selective inhibitors of HDAC-like enzymes from Pseudomonas aeruginosa. Bioorg Med Chem Lett27:1508-1512 (2017) 
 
Histone deacetylase 5
Name:Histone deacetylase 5
Type:Enzyme
Mol. Mass.:121968.61
Organism:Homo sapiens (Human)
Description:Q9UQL6
Residue:1122
BDBM50361260
NameBDBM50361260
Synonyms:CHEMBL1934902
TypeSmall organic molecule
Emp. Form.C22H13F12N5O3
Mol. Mass.623.3512
SMILESONC(=O)C(F)(F)C(F)(F)C(F)(F)C(F)(F)C(F)(F)C(F)(F)C(=O)Nc1ccc(cc1)-c1cnnn1-c1ccccc1