Reaction Details
TargetHistone deacetylase 7
LigandBDBM50235708
Substrate/Competitorn/a
Meas. Tech.ChEMBL_1657748 (CHEMBL4007218)
Ki>50000±n/a nM
Citation Meyners, CWolff, BKleinschek, AKrämer, AMeyer-Almes, FJ Perfluorinated hydroxamic acids are potent and selective inhibitors of HDAC-like enzymes from Pseudomonas aeruginosa. Bioorg Med Chem Lett27:1508-1512 (2017) 
 
Histone deacetylase 7
Name:Histone deacetylase 7
Type:Chromatin regulator; hydrolase; repressor
Mol. Mass.:102942.62
Organism:Homo sapiens (Human)
Description:Q8WUI4
Residue:952
BDBM50235708
NameBDBM50235708
Synonyms:CHEMBL4079958
TypeSmall organic molecule
Emp. Form.C14H7F13N2O3
Mol. Mass.498.1962
SMILESONC(=O)C(F)(F)C(F)(F)C(F)(F)C(F)(F)C(F)(F)C(F)(F)C(=O)Nc1ccc(F)cc1