Reaction Details
TargetHistone deacetylase 4
LigandBDBM50361266
Substrate/Competitorn/a
Meas. Tech.ChEMBL_1657750 (CHEMBL4007220)
Ki>50000±n/a nM
Citation Meyners, CWolff, BKleinschek, AKrämer, AMeyer-Almes, FJ Perfluorinated hydroxamic acids are potent and selective inhibitors of HDAC-like enzymes from Pseudomonas aeruginosa. Bioorg Med Chem Lett27:1508-1512 (2017) 
 
Histone deacetylase 4
Name:Histone deacetylase 4
Type:Enzyme
Mol. Mass.:119049.39
Organism:Homo sapiens (Human)
Description:P56524
Residue:1084
BDBM50361266
NameBDBM50361266
Synonyms:CHEMBL1934908
TypeSmall organic molecule
Emp. Form.C22H12F12N2O3
Mol. Mass.580.3231
SMILESONC(=O)C(F)(F)C(F)(F)C(F)(F)C(F)(F)C(F)(F)C(F)(F)C(=O)Nc1cc2ccccc2c2ccccc12